Error during Make

Izex

Rookie
Feb 16, 2016
61
4
8
USA
www.SC2Power.com
I get the following error when I do make. I appreciate any help and I am running the latest Ubuntu version.

[email protected]:/srv/ServUO# make
csc -win32icon:`pwd`/Server/servuo.ico -r:`pwd`/Ultima.dll,System.Drawing.dll -nowarn:0618,0219,0414,1635 -target:exe -out:`pwd`/ServUO.exe -d:MONO -d:ServUO -d:NEWTIMERS -nologo -optimize -unsafe -recurse:`pwd`/Server/*.cs
Server/ScriptCompiler.cs(219,20): error CS0246: The type or namespace name 'CSharpCodeProvider' could not be found (are you missing a using directive or an assembly reference?)
Server/ScriptCompiler.cs(219,54): error CS0246: The type or namespace name 'CSharpCodeProvider' could not be found (are you missing a using directive or an assembly reference?)
make: *** [Makefile:35: ServUO.exe] Error 1
[email protected]:/srv/ServUO#